Reaction Details
TargetInterstitial collagenase
LigandBDBM50102594
Substrate/Competitorn/a
Meas. Tech.ChEMBL_106154 (CHEMBL718850)
Ki 3±n/a nM
Citation Xue, CBVoss, MENelson, DJDuan, JJCherney, RJJacobson, ICHe, XRoderick, JChen, LCorbett, RLWang, LMeyer, DTKennedy, KDeGradodagger, WFHardman, KDTeleha, CAJaffee, BDLiu, RQCopeland, RACovington, MBChrist, DDTrzaskos, JMNewton, RCMagolda, RLWexler, RRDecicco, CP Design, synthesis, and structure-activity relationships of macrocyclic hydroxamic acids that inhibit tumor necrosis factor alpha release in vitro and in vivo. J Med Chem44:2636-60 (2001) Interstitial collagenase
Name:Interstitial collagenase
Type:Enzyme
Mol. Mass.:54010.26
Organism:Homo sapiens (Human)
Description: P03956
Residue:469
BDBM50102594
NameBDBM50102594
Synonyms:7-Isobutyl-8-oxo-2-oxa-9-aza-bicyclo[10.2.2]hexadeca-1(15),12(16),13-triene-6,10-dicarboxylic acid 6-hydroxyamide 10-methylcarbamoylmethyl-amide(SL422) | CHEMBL88520
TypeSmall organic molecule
Emp. Form.C23H34N4O6
Mol. Mass.462.5393
SMILESCNC(=O)CNC(=O)[C@@H]1Cc2ccc(OCCC[C@@H]([C@@H](CC(C)C)C(=O)N1)C(=O)NO)cc2