Reaction Details
TargetStromelysin-1
LigandBDBM50102631
Substrate/Competitorn/a
Meas. Tech.ChEMBL_104875 (CHEMBL709173)
Ki 2.9±n/a nM
Citation Xue, CBVoss, MENelson, DJDuan, JJCherney, RJJacobson, ICHe, XRoderick, JChen, LCorbett, RLWang, LMeyer, DTKennedy, KDeGradodagger, WFHardman, KDTeleha, CAJaffee, BDLiu, RQCopeland, RACovington, MBChrist, DDTrzaskos, JMNewton, RCMagolda, RLWexler, RRDecicco, CP Design, synthesis, and structure-activity relationships of macrocyclic hydroxamic acids that inhibit tumor necrosis factor alpha release in vitro and in vivo. J Med Chem44:2636-60 (2001) Stromelysin-1
Name:Stromelysin-1
Type:Enzyme
Mol. Mass.:53973.13
Organism:Homo sapiens (Human)
Description: P08254
Residue:477
BDBM50102631
NameBDBM50102631
Synonyms:8-Isobutyl-9-oxo-6-oxa-1,10-diaza-tricyclo[11.6.1.0*14,19*]icosa-13(20),14(19),15,17-tetraene-7,11-dicarboxylic acid 7-hydroxyamide 11-methylamide | CHEMBL88718
TypeSmall organic molecule
Emp. Form.C24H34N4O5
Mol. Mass.458.5506
SMILESCNC(=O)[C@@H]1Cc2cn(CCCCO[C@@H]([C@@H](CC(C)C)C(=O)N1)C(=O)NO)c1ccccc21