Reaction Details
TargetMatrix metalloproteinase-9
LigandBDBM50102614
Substrate/Competitorn/a
Meas. Tech.ChEMBL_105380 (CHEMBL710800)
Ki 2.1±n/a nM
Citation Xue, CBVoss, MENelson, DJDuan, JJCherney, RJJacobson, ICHe, XRoderick, JChen, LCorbett, RLWang, LMeyer, DTKennedy, KDeGradodagger, WFHardman, KDTeleha, CAJaffee, BDLiu, RQCopeland, RACovington, MBChrist, DDTrzaskos, JMNewton, RCMagolda, RLWexler, RRDecicco, CP Design, synthesis, and structure-activity relationships of macrocyclic hydroxamic acids that inhibit tumor necrosis factor alpha release in vitro and in vivo. J Med Chem44:2636-60 (2001) Matrix metalloproteinase-9
Name:Matrix metalloproteinase-9
Type:Enzyme
Mol. Mass.:78452.28
Organism:Homo sapiens (Human)
Description:P14780
Residue:707
BDBM50102614
NameBDBM50102614
Synonyms:7-Isobutyl-8-oxo-2-oxa-9-aza-bicyclo[11.2.2]heptadeca-1(16),13(17),14-triene-6,10-dicarboxylic acid 6-hydroxyamide 10-methylamide | CHEMBL433381
TypeSmall organic molecule
Emp. Form.C22H33N3O5
Mol. Mass.419.5145
SMILESCNC(=O)[C@@H]1CCc2ccc(OCCC[C@@H]([C@@H](CC(C)C)C(=O)N1)C(=O)NO)cc2