Reaction Details
TargetDisintegrin and metalloproteinase domain-containing protein 17
LigandBDBM50076995
Substrate/Competitorn/a
Meas. Tech.ChEMBL_89920 (CHEMBL702337)
IC50 1400±n/a nM
Citation Xue, CBVoss, MENelson, DJDuan, JJCherney, RJJacobson, ICHe, XRoderick, JChen, LCorbett, RLWang, LMeyer, DTKennedy, KDeGradodagger, WFHardman, KDTeleha, CAJaffee, BDLiu, RQCopeland, RACovington, MBChrist, DDTrzaskos, JMNewton, RCMagolda, RLWexler, RRDecicco, CP Design, synthesis, and structure-activity relationships of macrocyclic hydroxamic acids that inhibit tumor necrosis factor alpha release in vitro and in vivo. J Med Chem44:2636-60 (2001) Disintegrin and metalloproteinase domain-containing protein 17
Name:Disintegrin and metalloproteinase domain-containing protein 17
Type:Enzyme
Mol. Mass.:93007.89
Organism:Homo sapiens (Human)
Description:
Residue:824
BDBM50076995
NameBDBM50076995
Synonyms:(6S,9R,10S)-10-Hydroxycarbamoyl-9-isobutyl-6-methylcarbamoyl-8-oxo-1,7diaza-cyclotridecane-1-carboxylic acid tert-butyl ester CHEMBL23725
TypeSmall organic molecule
Emp. Form.C23H42N4O6
Mol. Mass.470.6028
SMILESCNC(=O)[C@@H]1CCCCN(CCC[C@@H]([C@@H](CC(C)C)C(=O)N1)C(=O)NO)C(=O)OC(C)(C)C