Reaction Details
TargetNitric oxide synthase, inducible
LigandBDBM21960
Substrate/Competitorn/a
Meas. Tech.ChEMBL_220570 (CHEMBL841851)
Ki 39000±n/a nM
Citation Hah, JMRoman, LJMartásek, PSilverman, RB Reduced amide bond peptidomimetics. (4S)-N-(4-amino-5-[aminoakyl]aminopentyl)-N'-nitroguanidines, potent and highly selective inhibitors of neuronal nitric oxide synthase. J Med Chem44:2667-70 (2001) Nitric oxide synthase, inducible
Name:Nitric oxide synthase, inducible
Type:Enzyme
Mol. Mass.:130595.79
Organism:Mus musculus (mouse)
Description:Recombinant enzyme overexpressed in E. coli.
Residue:1144
BDBM21960
NameBDBM21960
Synonyms:3-[(4S)-4-amino-5-[(2-aminoethyl)amino]pentyl]-1-nitroguanidine JMC522060 Compound 2 | N omega-Nitro-L-Arginine-Containing Dipeptide, 1
Typen/a
Emp. Form.C8H21N7O2
Mol. Mass.247.298
SMILESNCCNC[C@@H](N)CCCN=C(N)N[N+]([O-])=O