Reaction Details
TargetKappa-type opioid receptor
LigandBDBM50346474
Substrate/Competitorn/a
Meas. Tech.ChEMBL_146235 (CHEMBL755003)
Ki 0.45±n/a nM
Citation Soukara, SMaier, CAPredoiu, UEhret, AJackisch, RWünsch, B Methylated analogues of methyl (R)-4-(3,4-dichlorophenylacetyl)- 3-(pyrrolidin-1-ylmethyl)piperazine-1-carboxylate (GR-89,696) as highly potent kappa-receptor agonists: stereoselective synthesis, opioid-receptor affinity, receptor selectivity, and functional studies. J Med Chem44:2814-26 (2001) Kappa-type opioid receptor
Name:Kappa-type opioid receptor
Type:G Protein-Coupled Receptor (GPCR)
Mol. Mass.:42744.99
Organism:Cavia porcellus (domestic guinea pig)
Description:P41144
Residue:380
BDBM50346474
NameBDBM50346474
Synonyms:(R)-4-[2-(3,4-Dichloro-phenyl)-acetyl]-3-pyrrolidin-1-ylmethyl-piperazine-1-carboxylic acid methyl ester (R)-methyl4-(2-(3,4-dichlorophenyl)acetyl)-3-(pyrrolidin-1-ylmethyl)piperazine-1-carboxylate 4-[2-(3,4-Dichloro-phenyl)-acetyl]-3-pyrrolidin-1-ylmethyl-piperazine-1-carboxylic acid methyl ester CHEMBL277863 GR-89696
TypeSmall organic molecule
Emp. Form.C19H25Cl2N3O3
Mol. Mass.414.326
SMILESCOC(=O)N1CCN([C@H](CN2CCCC2)C1)C(=O)Cc1ccc(Cl)c(Cl)c1