Reaction Details
TargetSomatostatin receptor type 3
LigandBDBM50103428
Substrate/Competitorn/a
Meas. Tech.ChEMBL_200827 (CHEMBL807040)
Ki 430±n/a nM
Citation Poitout, LRoubert, PContour-Galcéra, MOMoinet, CLannoy, JPommier, JPlas, PBigg, DThurieau, C Identification of potent non-peptide somatostatin antagonists with sst(3) selectivity. J Med Chem44:2990-3000 (2001) Somatostatin receptor type 3
Name:Somatostatin receptor type 3
Type:Protein
Mol. Mass.:45855.97
Organism:Homo sapiens (Human)
Description:P32745
Residue:418
BDBM50103428
NameBDBM50103428
Synonyms:1,1-Dibutyl-3-(4-phenyl-1H-imidazol-2-yl)-1,2,3,4-tetrahydro-benzo[4,5]thieno[2,3-c]pyridine | CHEMBL322012
TypeSmall organic molecule
Emp. Form.C28H33N3S
Mol. Mass.443.647
SMILESCCCCC1(CCCC)N[C@H](Cc2c1sc1ccccc21)c1nc(c[nH]1)-c1ccccc1