Reaction Details
Target5-hydroxytryptamine receptor 1A
LigandBDBM50095801
Substrate/Competitorn/a
Meas. Tech.ChEMBL_1422 (CHEMBL616210)
Ki 1.2±n/a nM
Citation López-Rodríguez, MLMorcillo, MJFernández, EPorras, EOrensanz, LBeneytez, MEManzanares, JFuentes, JA Synthesis and structure-activity relationships of a new model of arylpiperazines. 5. Study of the physicochemical influence of the pharmacophore on 5-HT(1a)/alpha(1)-adrenergic receptor affinity: synthesis of a new derivative with mixed 5-HT(1a)/d(2) antagonist properties. J Med Chem44:186-97 (2001) 5-hydroxytryptamine receptor 1A
Name:5-hydroxytryptamine receptor 1A
Type:G Protein-Coupled Receptor (GPCR)
Mol. Mass.:46445.29
Organism:Rattus norvegicus (rat)
Description:Binding assays were performed using rat hippocampal membranes.
Residue:422
BDBM50095801
NameBDBM50095801
Synonyms:2-{4-[4-(2-Butoxy-phenyl)-piperazin-1-yl]-butyl}-tetrahydro-imidazo[1,5-a]pyridine-1,3-dione CHEMBL61545
TypeSmall organic molecule
Emp. Form.C25H38N4O3
Mol. Mass.442.5942
SMILESCCCCOc1ccccc1N1CCN(CCCCn2c(O)c3CCCCn3c2=O)CC1