Reaction Details
Target2-oxoglutarate receptor 1
LigandBDBM50369936
Substrate/Competitorn/a
Meas. Tech.ChEMBL_151406 (CHEMBL754752)
Ki 22±n/a nM
Citation Umino, TYoshioka, KSaitoh, YMinakawa, NNakata, HMatsuda, A Nucleosides and nucleotides. 200. Reinvestigation of 5'-N-ethylcarboxamidoadenosine derivatives: structure-activity relationships for P(3) purinoceptor-like proteins. J Med Chem44:208-14 (2001) 2-oxoglutarate receptor 1
Name:2-oxoglutarate receptor 1
Type:PROTEIN
Mol. Mass.:38385.93
Organism:Rattus norvegicus
Description:ChEMBL_151406
Residue:337
BDBM50369936
NameBDBM50369936
Synonyms:CHEMBL609773
TypeSmall organic molecule
Emp. Form.C17H24N6O4
Mol. Mass.376.4103
SMILESNc1ncnc2n(cnc12)C1O[C@@H]([C@@H](O)[C@H]1O)C(=O)NC1CCCCCC1