Reaction Details
Target2-oxoglutarate receptor 1
LigandBDBM50369942
Substrate/Competitorn/a
Meas. Tech.ChEMBL_151406 (CHEMBL754752)
Ki 19±n/a nM
Citation Umino, TYoshioka, KSaitoh, YMinakawa, NNakata, HMatsuda, A Nucleosides and nucleotides. 200. Reinvestigation of 5'-N-ethylcarboxamidoadenosine derivatives: structure-activity relationships for P(3) purinoceptor-like proteins. J Med Chem44:208-14 (2001) 2-oxoglutarate receptor 1
Name:2-oxoglutarate receptor 1
Type:PROTEIN
Mol. Mass.:38385.93
Organism:Rattus norvegicus
Description:ChEMBL_151406
Residue:337
BDBM50369942
NameBDBM50369942
Synonyms:CHEMBL607719
TypeSmall organic molecule
Emp. Form.C16H24N6O4
Mol. Mass.364.3996
SMILESCCCCCCNC(=O)[C@H]1OC([C@H](O)[C@@H]1O)n1cnc2c(N)ncnc12