Reaction Details
TargetEndothelin-1 receptor
LigandBDBM50105053
Substrate/Competitorn/a
Meas. Tech.ChEMBL_65793 (CHEMBL677974)
IC50>10±n/a nM
Citation Morimoto, HOhashi, NShimadzu, HKushiyama, EKawanishi, HHosaka, TKawase, YYasuda, KKikkawa, KYamauchi-Kohno, RYamada, K Potent and selective ET-A antagonists. 2. Discovery and evaluation of potent and water soluble N-(6-(2-(aryloxy)ethoxy)-4-pyrimidinyl)sulfonamide derivatives. J Med Chem44:3369-77 (2001) Endothelin-1 receptor
Name:Endothelin-1 receptor
Type:PROTEIN
Mol. Mass.:48707.29
Organism:Sus scrofa
Description:ChEMBL_65803
Residue:427
BDBM50105053
NameBDBM50105053
Synonyms:4-{4-(4-tert-Butyl-benzenesulfonylamino)-6-[2-(5-methylsulfanyl-pyrimidin-2-yloxy)-ethoxy]-pyrimidin-5-yl}-benzoic acid. H2O | CHEMBL115871
TypeSmall organic molecule
Emp. Form.C28H29N5O6S2
Mol. Mass.595.69
SMILESCSc1cnc(OCCOc2ncnc(NS(=O)(=O)c3ccc(cc3)C(C)(C)C)c2-c2ccc(cc2)C(O)=O)nc1