Reaction Details
TargetEndothelin-1 receptor
LigandBDBM50105055
Substrate/Competitorn/a
Meas. Tech.ChEMBL_65793 (CHEMBL677974)
IC50 0.0026±n/a nM
Citation Morimoto, HOhashi, NShimadzu, HKushiyama, EKawanishi, HHosaka, TKawase, YYasuda, KKikkawa, KYamauchi-Kohno, RYamada, K Potent and selective ET-A antagonists. 2. Discovery and evaluation of potent and water soluble N-(6-(2-(aryloxy)ethoxy)-4-pyrimidinyl)sulfonamide derivatives. J Med Chem44:3369-77 (2001) Endothelin-1 receptor
Name:Endothelin-1 receptor
Type:PROTEIN
Mol. Mass.:48707.29
Organism:Sus scrofa
Description:ChEMBL_65803
Residue:427
BDBM50105055
NameBDBM50105055
Synonyms:4-tert-Butyl-N-{6-[2-(5-hydroxymethyl-pyrimidin-2-yloxy)-ethoxy]-5-p-tolyl-pyrimidin-4-yl}-benzenesulfonamide | CHEMBL115372
TypeSmall organic molecule
Emp. Form.C28H31N5O5S
Mol. Mass.549.641
SMILESCc1ccc(cc1)-c1c(NS(=O)(=O)c2ccc(cc2)C(C)(C)C)ncnc1OCCOc1ncc(CO)cn1