Reaction Details
TargetEndothelin-1 receptor
LigandBDBM50105000
Substrate/Competitorn/a
Meas. Tech.ChEMBL_65793 (CHEMBL677974)
IC50 7.5±n/a nM
Citation Morimoto, HOhashi, NShimadzu, HKushiyama, EKawanishi, HHosaka, TKawase, YYasuda, KKikkawa, KYamauchi-Kohno, RYamada, K Potent and selective ET-A antagonists. 2. Discovery and evaluation of potent and water soluble N-(6-(2-(aryloxy)ethoxy)-4-pyrimidinyl)sulfonamide derivatives. J Med Chem44:3369-77 (2001) Endothelin-1 receptor
Name:Endothelin-1 receptor
Type:PROTEIN
Mol. Mass.:48707.29
Organism:Sus scrofa
Description:ChEMBL_65803
Residue:427
BDBM50105000
NameBDBM50105000
Synonyms:CHEMBL175616 | sodium salt of 4-tert-Butyl-N-[6-(2-hydroxy-ethoxy)-5-(2-methoxy-phenoxy)-[2,2']bipyrimidinyl-4-yl]-benzenesulfonamide
TypeSmall organic molecule
Emp. Form.C27H28N5O6S
Mol. Mass.550.607
SMILESCOc1ccccc1Oc1c([N-]S(=O)(=O)c2ccc(cc2)C(C)(C)C)nc(nc1OCCO)-c1ncccn1