Reaction Details
TargetEndothelin-1 receptor
LigandBDBM50369953
Substrate/Competitorn/a
Meas. Tech.ChEMBL_63218 (CHEMBL674070)
IC50 0.33±n/a nM
Citation Morimoto, HOhashi, NShimadzu, HKushiyama, EKawanishi, HHosaka, TKawase, YYasuda, KKikkawa, KYamauchi-Kohno, RYamada, K Potent and selective ET-A antagonists. 2. Discovery and evaluation of potent and water soluble N-(6-(2-(aryloxy)ethoxy)-4-pyrimidinyl)sulfonamide derivatives. J Med Chem44:3369-77 (2001) Endothelin-1 receptor
Name:Endothelin-1 receptor
Type:Enzyme Catalytic Domain
Mol. Mass.:48256.91
Organism:RAT
Description:ENDOTHELIN A EDNRA RAT::P26684
Residue:426
BDBM50369953
NameBDBM50369953
Synonyms:CHEMBL1627022
TypeSmall organic molecule
Emp. Form.C27H27BrN5O5S
Mol. Mass.613.503
SMILESCc1ccc(cc1)-c1c([N-]S(=O)(=O)c2ccc(cc2)C(C)(C)CO)ncnc1OCCOc1ncc(Br)cn1