Reaction Details
TargetDelta-type opioid receptor
LigandBDBM50105092
Substrate/Competitorn/a
Meas. Tech.ChEMBL_145324 (CHEMBL750412)
IC50>10000±n/a nM
Citation Poulain, RHorvath, DBonnet, BEckhoff, CChapelain, BBodinier, MCDéprez, B From hit to lead. Combining two complementary methods for focused library design. Application to mu opiate ligands. J Med Chem44:3378-90 (2001) Delta-type opioid receptor
Name:Delta-type opioid receptor
Type:G Protein-Coupled Receptor (GPCR)
Mol. Mass.:40382.98
Organism:Homo sapiens (Human)
Description:Competition binding assays were carried out using membrane preparations from transfected HN9.10 cells that constitutively expressed the delta opioid receptor.
Residue:372
BDBM50105092
NameBDBM50105092
Synonyms:CHEMBL114327 | [2-(2-Oxo-2,3-dihydro-benzoimidazol-1-yl)-ethyl]-carbamic acid 6-chloro-benzo[1,3]dioxol-5-ylmethyl ester
TypeSmall organic molecule
Emp. Form.C18H16ClN3O5
Mol. Mass.389.79
SMILESClc1cc2OCOc2cc1COC(=O)NCCn1c2ccccc2[nH]c1=O