Reaction Details
TargetMu-type opioid receptor
LigandBDBM50017698
Substrate/Competitorn/a
Meas. Tech.ChEMBL_149489 (CHEMBL757060)
IC50 1.5±n/a nM
Citation Poulain, RHorvath, DBonnet, BEckhoff, CChapelain, BBodinier, MCDéprez, B From hit to lead. Combining two complementary methods for focused library design. Application to mu opiate ligands. J Med Chem44:3378-90 (2001) Mu-type opioid receptor
Name:Mu-type opioid receptor
Type:G Protein-Coupled Receptor (GPCR)
Mol. Mass.:44789.51
Organism:Homo sapiens (Human)
Description:P35372
Residue:400
BDBM50017698
NameBDBM50017698
Synonyms:4-(4-(4-chlorophenyl)-4-hydroxypiperidin-1-yl)-N,N-dimethyl-2,2-diphenylbutanamide 4-[4-(4-Chloro-phenyl)-4-hydroxy-piperidin-1-yl]-N,N-dimethyl-2,2-diphenyl-butyramide(loperamide) Imodium LOPERAMIDE HYDROCHLORIDE med.21724, Compound 184
TypeSmall organic molecule
Emp. Form.C29H33ClN2O2
Mol. Mass.477.038
SMILESCN(C)C(=O)C(CCN1CCC(O)(CC1)c1ccc(Cl)cc1)(c1ccccc1)c1ccccc1