Reaction Details
TargetDelta-type opioid receptor
LigandBDBM50105079
Substrate/Competitorn/a
Meas. Tech.ChEMBL_145324 (CHEMBL750412)
IC50>10000±n/a nM
Citation Poulain, RHorvath, DBonnet, BEckhoff, CChapelain, BBodinier, MCDéprez, B From hit to lead. Combining two complementary methods for focused library design. Application to mu opiate ligands. J Med Chem44:3378-90 (2001) Delta-type opioid receptor
Name:Delta-type opioid receptor
Type:G Protein-Coupled Receptor (GPCR)
Mol. Mass.:40382.98
Organism:Homo sapiens (Human)
Description:Competition binding assays were carried out using membrane preparations from transfected HN9.10 cells that constitutively expressed the delta opioid receptor.
Residue:372
BDBM50105079
NameBDBM50105079
Synonyms:4-(2-Oxo-3,4-dihydro-2H-quinoxalin-1-yl)-piperidine-1-carboxylic acid 6-chloro-benzo[1,3]dioxol-5-ylmethyl ester | CHEMBL115284
TypeSmall organic molecule
Emp. Form.C22H22ClN3O5
Mol. Mass.443.88
SMILESClc1cc2OCOc2cc1COC(=O)N1CCC(CC1)N1C(=O)CNc2ccccc12