Reaction Details
TargetDelta-type opioid receptor
LigandBDBM50105078
Substrate/Competitorn/a
Meas. Tech.ChEMBL_145324 (CHEMBL750412)
IC50>10000±n/a nM
Citation Poulain, RHorvath, DBonnet, BEckhoff, CChapelain, BBodinier, MCDéprez, B From hit to lead. Combining two complementary methods for focused library design. Application to mu opiate ligands. J Med Chem44:3378-90 (2001) Delta-type opioid receptor
Name:Delta-type opioid receptor
Type:G Protein-Coupled Receptor (GPCR)
Mol. Mass.:40382.98
Organism:Homo sapiens (Human)
Description:Competition binding assays were carried out using membrane preparations from transfected HN9.10 cells that constitutively expressed the delta opioid receptor.
Residue:372
BDBM50105078
NameBDBM50105078
Synonyms:1-{1-[3-(4,5-Dimethoxy-2-nitro-phenyl)-acryloyl]-piperidin-4-yl}-1,3-dihydro-benzoimidazol-2-one | CHEMBL332697
TypeSmall organic molecule
Emp. Form.C23H24N4O6
Mol. Mass.452.4599
SMILESCOc1cc(\C=C\C(=O)N2CCC(CC2)n2[c-]3ccccc3nc2=[OH+])c(cc1OC)[N+]([O-])=O