Reaction Details
TargetDelta-type opioid receptor
LigandBDBM50105065
Substrate/Competitorn/a
Meas. Tech.ChEMBL_145324 (CHEMBL750412)
IC50>10000±n/a nM
Citation Poulain, RHorvath, DBonnet, BEckhoff, CChapelain, BBodinier, MCDéprez, B From hit to lead. Combining two complementary methods for focused library design. Application to mu opiate ligands. J Med Chem44:3378-90 (2001) Delta-type opioid receptor
Name:Delta-type opioid receptor
Type:G Protein-Coupled Receptor (GPCR)
Mol. Mass.:40382.98
Organism:Homo sapiens (Human)
Description:Competition binding assays were carried out using membrane preparations from transfected HN9.10 cells that constitutively expressed the delta opioid receptor.
Residue:372
BDBM50105065
NameBDBM50105065
Synonyms:4-(2-Oxo-2,3-dihydro-benzoimidazol-1-yl)-3,6-dihydro-2H-pyridine-1-carboxylic acid 6-nitro-benzo[1,3]dioxol-5-ylmethyl ester | CHEMBL114940
TypeSmall organic molecule
Emp. Form.C21H18N4O7
Mol. Mass.438.3902
SMILES[O-][N+](=O)c1cc2OCOc2cc1COC(=O)N1CCC(=CC1)n1[c-]2ccccc2nc1=[OH+]