Reaction Details
TargetDelta-type opioid receptor
LigandBDBM50105089
Substrate/Competitorn/a
Meas. Tech.ChEMBL_145324 (CHEMBL750412)
IC50 1190±n/a nM
Citation Poulain, RHorvath, DBonnet, BEckhoff, CChapelain, BBodinier, MCDéprez, B From hit to lead. Combining two complementary methods for focused library design. Application to mu opiate ligands. J Med Chem44:3378-90 (2001) Delta-type opioid receptor
Name:Delta-type opioid receptor
Type:G Protein-Coupled Receptor (GPCR)
Mol. Mass.:40382.98
Organism:Homo sapiens (Human)
Description:Competition binding assays were carried out using membrane preparations from transfected HN9.10 cells that constitutively expressed the delta opioid receptor.
Residue:372
BDBM50105089
NameBDBM50105089
Synonyms:8-Benzo[1,3]dioxol-5-ylmethyl-1-phenyl-1,3,8-triaza-spiro[4.5]decan-4-one | CHEMBL326962
TypeSmall organic molecule
Emp. Form.C21H23N3O3
Mol. Mass.365.4256
SMILESO=C1NCN(c2ccccc2)C11CCN(Cc2ccc3OCOc3c2)CC1