Reaction Details
TargetDelta-type opioid receptor
LigandBDBM50105096
Substrate/Competitorn/a
Meas. Tech.ChEMBL_145324 (CHEMBL750412)
IC50>10000±n/a nM
Citation Poulain, RHorvath, DBonnet, BEckhoff, CChapelain, BBodinier, MCDéprez, B From hit to lead. Combining two complementary methods for focused library design. Application to mu opiate ligands. J Med Chem44:3378-90 (2001) Delta-type opioid receptor
Name:Delta-type opioid receptor
Type:G Protein-Coupled Receptor (GPCR)
Mol. Mass.:40382.98
Organism:Homo sapiens (Human)
Description:Competition binding assays were carried out using membrane preparations from transfected HN9.10 cells that constitutively expressed the delta opioid receptor.
Residue:372
BDBM50105096
NameBDBM50105096
Synonyms:(5-Chloro-1H-indol-2-yl)-[4-(2,4-dinitro-benzenesulfonyl)-piperazin-1-yl]-methanone | CHEMBL325697
TypeSmall organic molecule
Emp. Form.C19H16ClN5O7S
Mol. Mass.493.878
SMILES[O-][N+](=O)c1ccc(c(c1)[N+]([O-])=O)S(=O)(=O)N1CCN(CC1)C(=O)c1cc2cc(Cl)ccc2[nH]1