Reaction Details
TargetDelta-type opioid receptor
LigandBDBM50105091
Substrate/Competitorn/a
Meas. Tech.ChEMBL_145324 (CHEMBL750412)
IC50 11±n/a nM
Citation Poulain, RHorvath, DBonnet, BEckhoff, CChapelain, BBodinier, MCDéprez, B From hit to lead. Combining two complementary methods for focused library design. Application to mu opiate ligands. J Med Chem44:3378-90 (2001) Delta-type opioid receptor
Name:Delta-type opioid receptor
Type:G Protein-Coupled Receptor (GPCR)
Mol. Mass.:40382.98
Organism:Homo sapiens (Human)
Description:Competition binding assays were carried out using membrane preparations from transfected HN9.10 cells that constitutively expressed the delta opioid receptor.
Residue:372
BDBM50105091
NameBDBM50105091
Synonyms:2-[8-(6-Chloro-benzo[1,3]dioxol-5-ylmethyl)-4-oxo-1-phenyl-1,3,8-triaza-spiro[4.5]dec-3-yl]-N-methyl-acetamide | CHEMBL115222
TypeSmall organic molecule
Emp. Form.C24H27ClN4O4
Mol. Mass.470.949
SMILESCNC(=O)CN1CN(c2ccccc2)C2(CCN(Cc3cc4OCOc4cc3Cl)CC2)C1=O