Reaction Details
TargetDelta-type opioid receptor
LigandBDBM82507
Substrate/Competitorn/a
Meas. Tech.ChEMBL_145324 (CHEMBL750412)
IC50 1090±n/a nM
Citation Poulain, RHorvath, DBonnet, BEckhoff, CChapelain, BBodinier, MCDéprez, B From hit to lead. Combining two complementary methods for focused library design. Application to mu opiate ligands. J Med Chem44:3378-90 (2001) Delta-type opioid receptor
Name:Delta-type opioid receptor
Type:G Protein-Coupled Receptor (GPCR)
Mol. Mass.:40382.98
Organism:Homo sapiens (Human)
Description:Competition binding assays were carried out using membrane preparations from transfected HN9.10 cells that constitutively expressed the delta opioid receptor.
Residue:372
BDBM82507
NameBDBM82507
Synonyms:(+/-)-Methadone METHADONE NSC_22266
TypeSmall organic molecule
Emp. Form.C21H27NO
Mol. Mass.309.4452
SMILESCCC(=O)C(CC(C)N(C)C)(c1ccccc1)c1ccccc1