Reaction Details
TargetKappa-type opioid receptor
LigandBDBM50105062
Substrate/Competitorn/a
Meas. Tech.ChEMBL_145105 (CHEMBL751989)
IC50 1480±n/a nM
Citation Poulain, RHorvath, DBonnet, BEckhoff, CChapelain, BBodinier, MCDéprez, B From hit to lead. Combining two complementary methods for focused library design. Application to mu opiate ligands. J Med Chem44:3378-90 (2001) Kappa-type opioid receptor
Name:Kappa-type opioid receptor
Type:G Protein-Coupled Receptor (GPCR)
Mol. Mass.:42648.76
Organism:Homo sapiens (Human)
Description:P41145
Residue:380
BDBM50105062
NameBDBM50105062
Synonyms:4-Oxo-1-phenyl-1,3,8-triaza-spiro[4.5]decane-8-carboxylic acid 1,3-dihydro-benzo[1,2,5]thiadiazol-5-ylmethyl ester CHEMBL324257
TypeSmall organic molecule
Emp. Form.C21H21N5O3S
Mol. Mass.423.488
SMILESO=C(OCc1ccc2nsnc2c1)N1CCC2(CC1)N(CNC2=O)c1ccccc1