Reaction Details
TargetKappa-type opioid receptor
LigandBDBM50105064
Substrate/Competitorn/a
Meas. Tech.ChEMBL_145105 (CHEMBL751989)
IC50 7240±n/a nM
Citation Poulain, RHorvath, DBonnet, BEckhoff, CChapelain, BBodinier, MCDéprez, B From hit to lead. Combining two complementary methods for focused library design. Application to mu opiate ligands. J Med Chem44:3378-90 (2001) Kappa-type opioid receptor
Name:Kappa-type opioid receptor
Type:G Protein-Coupled Receptor (GPCR)
Mol. Mass.:42648.76
Organism:Homo sapiens (Human)
Description:P41145
Residue:380
BDBM50105064
NameBDBM50105064
Synonyms:4-Methoxy-5-[4-(2-phenylamino-benzoyl)-piperazine-1-sulfonyl]-thiophene-3-carboxylic acid methyl ester | CHEMBL324479
TypeSmall organic molecule
Emp. Form.C24H25N3O6S2
Mol. Mass.515.602
SMILESCOC(=O)c1csc(c1OC)S(=O)(=O)N1CCN(CC1)C(=O)c1ccccc1Nc1ccccc1