Reaction Details
TargetKappa-type opioid receptor
LigandBDBM50105069
Substrate/Competitorn/a
Meas. Tech.ChEMBL_145105 (CHEMBL751989)
IC50 270±n/a nM
Citation Poulain, RHorvath, DBonnet, BEckhoff, CChapelain, BBodinier, MCDéprez, B From hit to lead. Combining two complementary methods for focused library design. Application to mu opiate ligands. J Med Chem44:3378-90 (2001) Kappa-type opioid receptor
Name:Kappa-type opioid receptor
Type:G Protein-Coupled Receptor (GPCR)
Mol. Mass.:42648.76
Organism:Homo sapiens (Human)
Description:P41145
Residue:380
BDBM50105069
NameBDBM50105069
Synonyms:1-[1-(2-Chloro-4-methoxy-benzyl)-piperidin-4-yl]-1,3-dihydro-benzoimidazol-2-one | CHEMBL112191
TypeSmall organic molecule
Emp. Form.C20H22ClN3O2
Mol. Mass.371.861
SMILESCOc1ccc(CN2CCC(CC2)n2c3ccccc3[nH]c2=O)c(Cl)c1