Reaction Details
TargetKappa-type opioid receptor
LigandBDBM50105081
Substrate/Competitorn/a
Meas. Tech.ChEMBL_145105 (CHEMBL751989)
IC50>10000±n/a nM
Citation Poulain, RHorvath, DBonnet, BEckhoff, CChapelain, BBodinier, MCDéprez, B From hit to lead. Combining two complementary methods for focused library design. Application to mu opiate ligands. J Med Chem44:3378-90 (2001) Kappa-type opioid receptor
Name:Kappa-type opioid receptor
Type:G Protein-Coupled Receptor (GPCR)
Mol. Mass.:42648.76
Organism:Homo sapiens (Human)
Description:P41145
Residue:380
BDBM50105081
NameBDBM50105081
Synonyms:8-[3-(4,5-Dimethoxy-2-nitro-phenyl)-acryloyl]-1-phenyl-1,3,8-triaza-spiro[4.5]decan-4-one | CHEMBL324471
TypeSmall organic molecule
Emp. Form.C24H26N4O6
Mol. Mass.466.4864
SMILESCOc1cc(C=CC(=O)N2CCC3(CC2)N(CNC3=O)c2ccccc2)c(cc1OC)[N+]([O-])=O