Reaction Details
TargetMu-type opioid receptor
LigandBDBM50105063
Substrate/Competitorn/a
Meas. Tech.ChEMBL_149489 (CHEMBL757060)
IC50>10000±n/a nM
Citation Poulain, RHorvath, DBonnet, BEckhoff, CChapelain, BBodinier, MCDéprez, B From hit to lead. Combining two complementary methods for focused library design. Application to mu opiate ligands. J Med Chem44:3378-90 (2001) Mu-type opioid receptor
Name:Mu-type opioid receptor
Type:G Protein-Coupled Receptor (GPCR)
Mol. Mass.:44789.51
Organism:Homo sapiens (Human)
Description:P35372
Residue:400
BDBM50105063
NameBDBM50105063
Synonyms:1-{1-[2-(4,5-Dimethoxy-2-nitro-phenyl)-acetyl]-piperidin-4-yl}-1,3-dihydro-benzoimidazol-2-one | CHEMBL114204
TypeSmall organic molecule
Emp. Form.C22H24N4O6
Mol. Mass.440.4492
SMILESCOc1cc(CC(=O)N2CCC(CC2)n2[c-]3ccccc3nc2=[OH+])c(cc1OC)[N+]([O-])=O