Reaction Details
TargetKappa-type opioid receptor
LigandBDBM50105095
Substrate/Competitorn/a
Meas. Tech.ChEMBL_145105 (CHEMBL751989)
IC50 1010±n/a nM
Citation Poulain, RHorvath, DBonnet, BEckhoff, CChapelain, BBodinier, MCDéprez, B From hit to lead. Combining two complementary methods for focused library design. Application to mu opiate ligands. J Med Chem44:3378-90 (2001) Kappa-type opioid receptor
Name:Kappa-type opioid receptor
Type:G Protein-Coupled Receptor (GPCR)
Mol. Mass.:42648.76
Organism:Homo sapiens (Human)
Description:P41145
Residue:380
BDBM50105095
NameBDBM50105095
Synonyms:2-(5-Bromo-1H-indol-3-yl)-1-[4-(7-nitro-benzo[1,2,5]oxadiazol-4-yl)-piperazin-1-yl]-ethanone | CHEMBL114824
TypeSmall organic molecule
Emp. Form.C20H17BrN6O4
Mol. Mass.485.291
SMILES[O-][N+](=O)c1ccc(N2CCN(CC2)C(=O)Cc2c[nH]c3ccc(Br)cc23)c2[n-][o+]nc12