Reaction Details
TargetDelta-type opioid receptor
LigandBDBM50105072
Substrate/Competitorn/a
Meas. Tech.ChEMBL_145323 (CHEMBL750411)
IC50 138±n/a nM
Citation Poulain, RHorvath, DBonnet, BEckhoff, CChapelain, BBodinier, MCDéprez, B From hit to lead. Analyzing structure-profile relationships. J Med Chem44:3391-401 (2001) Delta-type opioid receptor
Name:Delta-type opioid receptor
Type:G Protein-Coupled Receptor (GPCR)
Mol. Mass.:40382.98
Organism:Homo sapiens (Human)
Description:Competition binding assays were carried out using membrane preparations from transfected HN9.10 cells that constitutively expressed the delta opioid receptor.
Residue:372
BDBM50105072
NameBDBM50105072
Synonyms:8-(6-Chloro-benzo[1,3]dioxol-5-ylmethyl)-1-phenyl-1,3,8-triaza-spiro[4.5]decan-4-one | CHEMBL115652
TypeSmall organic molecule
Emp. Form.C21H22ClN3O3
Mol. Mass.399.871
SMILESClc1cc2OCOc2cc1CN1CCC2(CC1)N(CNC2=O)c1ccccc1