Reaction Details
TargetDelta-type opioid receptor
LigandBDBM50105094
Substrate/Competitorn/a
Meas. Tech.ChEMBL_145323 (CHEMBL750411)
IC50 37±n/a nM
Citation Poulain, RHorvath, DBonnet, BEckhoff, CChapelain, BBodinier, MCDéprez, B From hit to lead. Analyzing structure-profile relationships. J Med Chem44:3391-401 (2001) Delta-type opioid receptor
Name:Delta-type opioid receptor
Type:G Protein-Coupled Receptor (GPCR)
Mol. Mass.:40382.98
Organism:Homo sapiens (Human)
Description:Competition binding assays were carried out using membrane preparations from transfected HN9.10 cells that constitutively expressed the delta opioid receptor.
Residue:372
BDBM50105094
NameBDBM50105094
Synonyms:1-[1-(6-Chloro-benzo[1,3]dioxol-5-ylmethyl)-piperidin-4-yl]-1,3-dihydro-benzoimidazol-2-one | CHEMBL114379
TypeSmall organic molecule
Emp. Form.C20H20ClN3O3
Mol. Mass.385.844
SMILESClc1cc2OCOc2cc1CN1CCC(CC1)n1c2ccccc2[nH]c1=O