Reaction Details
TargetDelta-type opioid receptor
LigandBDBM50105105
Substrate/Competitorn/a
Meas. Tech.ChEMBL_145323 (CHEMBL750411)
IC50 5770±n/a nM
Citation Poulain, RHorvath, DBonnet, BEckhoff, CChapelain, BBodinier, MCDéprez, B From hit to lead. Analyzing structure-profile relationships. J Med Chem44:3391-401 (2001) Delta-type opioid receptor
Name:Delta-type opioid receptor
Type:G Protein-Coupled Receptor (GPCR)
Mol. Mass.:40382.98
Organism:Homo sapiens (Human)
Description:Competition binding assays were carried out using membrane preparations from transfected HN9.10 cells that constitutively expressed the delta opioid receptor.
Residue:372
BDBM50105105
NameBDBM50105105
Synonyms:CHEMBL116463 | {1-[4,4-Bis-(4-fluoro-phenyl)-butyl]-piperidin-4-yl}-carbamic acid 2-(4-cyano-phenyl)-ethyl ester
TypeSmall organic molecule
Emp. Form.C31H33F2N3O2
Mol. Mass.517.6094
SMILESFc1ccc(cc1)C(CCCN1CCC(CC1)NC(=O)OCCc1ccc(cc1)C#N)c1ccc(F)cc1