Reaction Details
TargetKappa-type opioid receptor
LigandBDBM50105080
Substrate/Competitorn/a
Meas. Tech.ChEMBL_145103 (CHEMBL882039)
IC50 37±n/a nM
Citation Poulain, RHorvath, DBonnet, BEckhoff, CChapelain, BBodinier, MCDéprez, B From hit to lead. Analyzing structure-profile relationships. J Med Chem44:3391-401 (2001) Kappa-type opioid receptor
Name:Kappa-type opioid receptor
Type:G Protein-Coupled Receptor (GPCR)
Mol. Mass.:42648.76
Organism:Homo sapiens (Human)
Description:P41145
Residue:380
BDBM50105080
NameBDBM50105080
Synonyms:1-[1-(6-Nitro-benzo[1,3]dioxol-5-ylmethyl)-piperidin-4-yl]-1,3-dihydro-benzoimidazol-2-one | CHEMBL324297
TypeSmall organic molecule
Emp. Form.C20H20N4O5
Mol. Mass.396.3966
SMILES[O-][N+](=O)c1cc2OCOc2cc1CN1CCC(CC1)n1[c-]2ccccc2nc1=[OH+]