Reaction Details
TargetMu-type opioid receptor
LigandBDBM50105090
Substrate/Competitorn/a
Meas. Tech.ChEMBL_149488 (CHEMBL757059)
IC50 179±n/a nM
Citation Poulain, RHorvath, DBonnet, BEckhoff, CChapelain, BBodinier, MCDéprez, B From hit to lead. Analyzing structure-profile relationships. J Med Chem44:3391-401 (2001) Mu-type opioid receptor
Name:Mu-type opioid receptor
Type:G Protein-Coupled Receptor (GPCR)
Mol. Mass.:44789.51
Organism:Homo sapiens (Human)
Description:P35372
Residue:400
BDBM50105090
NameBDBM50105090
Synonyms:3-Methylcarbamoylmethyl-4-oxo-1-phenyl-1,3,8-triaza-spiro[4.5]decane-8-carboxylic acid 6-chloro-benzo[1,3]dioxol-5-ylmethyl ester | CHEMBL114825
TypeSmall organic molecule
Emp. Form.C25H27ClN4O6
Mol. Mass.514.958
SMILESCNC(=O)CN1CN(c2ccccc2)C2(CCN(CC2)C(=O)OCc2cc3OCOc3cc2Cl)C1=O