Reaction Details
TargetKappa-type opioid receptor
LigandBDBM50105090
Substrate/Competitorn/a
Meas. Tech.ChEMBL_145103 (CHEMBL882039)
IC50 333±n/a nM
Citation Poulain, RHorvath, DBonnet, BEckhoff, CChapelain, BBodinier, MCDéprez, B From hit to lead. Analyzing structure-profile relationships. J Med Chem44:3391-401 (2001) Kappa-type opioid receptor
Name:Kappa-type opioid receptor
Type:G Protein-Coupled Receptor (GPCR)
Mol. Mass.:42648.76
Organism:Homo sapiens (Human)
Description:P41145
Residue:380
BDBM50105090
NameBDBM50105090
Synonyms:3-Methylcarbamoylmethyl-4-oxo-1-phenyl-1,3,8-triaza-spiro[4.5]decane-8-carboxylic acid 6-chloro-benzo[1,3]dioxol-5-ylmethyl ester | CHEMBL114825
TypeSmall organic molecule
Emp. Form.C25H27ClN4O6
Mol. Mass.514.958
SMILESCNC(=O)CN1CN(c2ccccc2)C2(CCN(CC2)C(=O)OCc2cc3OCOc3cc2Cl)C1=O