Reaction Details
TargetSodium-dependent dopamine transporter
LigandBDBM50105109
Substrate/Competitorn/a
Meas. Tech.ChEMBL_62968 (CHEMBL873582)
IC50 996±n/a nM
Citation Poulain, RHorvath, DBonnet, BEckhoff, CChapelain, BBodinier, MCDéprez, B From hit to lead. Analyzing structure-profile relationships. J Med Chem44:3391-401 (2001) Sodium-dependent dopamine transporter
Name:Sodium-dependent dopamine transporter
Type:Multi-pass membrane protein
Mol. Mass.:68497.11
Organism:Homo sapiens (Human)
Description:Q01959
Residue:620
BDBM50105109
NameBDBM50105109
Synonyms:4-[4,4-Bis-(4-fluoro-phenyl)-butyl]-piperazine-1-carboxylic acid 2-(4-cyano-phenyl)-ethyl ester | CHEMBL326263
TypeSmall organic molecule
Emp. Form.C30H31F2N3O2
Mol. Mass.503.5828
SMILESFc1ccc(cc1)C(CCCN1CCN(CC1)C(=O)OCCc1ccc(cc1)C#N)c1ccc(F)cc1