Reaction Details
TargetHistamine H2 receptor
LigandBDBM50105101
Substrate/Competitorn/a
Meas. Tech.ChEMBL_85522 (CHEMBL697133)
IC50 1250±n/a nM
Citation Poulain, RHorvath, DBonnet, BEckhoff, CChapelain, BBodinier, MCDéprez, B From hit to lead. Analyzing structure-profile relationships. J Med Chem44:3391-401 (2001) Histamine H2 receptor
Name:Histamine H2 receptor
Type:G Protein-Coupled Receptor (GPCR)
Mol. Mass.:40115.31
Organism:Homo sapiens (Human)
Description:n/a
Residue:359
BDBM50105101
NameBDBM50105101
Synonyms:4-[4,4-Bis-(4-fluoro-phenyl)-butyl]-piperazine-1-carboxylic acid 2-(4-fluoro-phenyl)-ethyl ester | CHEMBL325516
TypeSmall organic molecule
Emp. Form.C29H31F3N2O2
Mol. Mass.496.5638
SMILESFc1ccc(CCOC(=O)N2CCN(CCCC(c3ccc(F)cc3)c3ccc(F)cc3)CC2)cc1