Reaction Details
Target5-hydroxytryptamine receptor 6
LigandBDBM50105102
Substrate/Competitorn/a
Meas. Tech.ChEMBL_3607 (CHEMBL618090)
IC50 800±n/a nM
Citation Poulain, RHorvath, DBonnet, BEckhoff, CChapelain, BBodinier, MCDéprez, B From hit to lead. Analyzing structure-profile relationships. J Med Chem44:3391-401 (2001) 5-hydroxytryptamine receptor 6
Name:5-hydroxytryptamine receptor 6
Type:G Protein-Coupled Receptor (GPCR)
Mol. Mass.:46968.43
Organism:Homo sapiens (Human)
Description:P50406
Residue:440
BDBM50105102
NameBDBM50105102
Synonyms:4-[4,4-Bis-(4-fluoro-phenyl)-butyl]-piperazine-1-carboxylic acid [2-(4-ethoxy-phenyl)-ethyl]-amide | CHEMBL113956
TypeSmall organic molecule
Emp. Form.C31H37F2N3O2
Mol. Mass.521.6412
SMILESCCOc1ccc(CCNC(=O)N2CCN(CCCC(c3ccc(F)cc3)c3ccc(F)cc3)CC2)cc1