Reaction Details
Target5-hydroxytryptamine receptor 1A
LigandBDBM50105110
Substrate/Competitorn/a
Meas. Tech.ChEMBL_685 (CHEMBL616269)
IC50 1570±n/a nM
Citation Poulain, RHorvath, DBonnet, BEckhoff, CChapelain, BBodinier, MCDéprez, B From hit to lead. Analyzing structure-profile relationships. J Med Chem44:3391-401 (2001) 5-hydroxytryptamine receptor 1A
Name:5-hydroxytryptamine receptor 1A
Type:n/a
Mol. Mass.:46122.49
Organism:Homo sapiens (Human)
Description:n/a
Residue:422
BDBM50105110
NameBDBM50105110
Synonyms:4-(3-Phenyl-propyl)-piperazine-1-carboxylic acid 2-(4-cyano-phenyl)-ethyl ester | CHEMBL325258
TypeSmall organic molecule
Emp. Form.C23H27N3O2
Mol. Mass.377.4794
SMILESO=C(OCCc1ccc(cc1)C#N)N1CCN(CCCc2ccccc2)CC1