Reaction Details
TargetKappa-type opioid receptor
LigandBDBM50105089
Substrate/Competitorn/a
Meas. Tech.ChEMBL_145103 (CHEMBL882039)
IC50 56±n/a nM
Citation Poulain, RHorvath, DBonnet, BEckhoff, CChapelain, BBodinier, MCDéprez, B From hit to lead. Analyzing structure-profile relationships. J Med Chem44:3391-401 (2001) Kappa-type opioid receptor
Name:Kappa-type opioid receptor
Type:G Protein-Coupled Receptor (GPCR)
Mol. Mass.:42648.76
Organism:Homo sapiens (Human)
Description:P41145
Residue:380
BDBM50105089
NameBDBM50105089
Synonyms:8-Benzo[1,3]dioxol-5-ylmethyl-1-phenyl-1,3,8-triaza-spiro[4.5]decan-4-one | CHEMBL326962
TypeSmall organic molecule
Emp. Form.C21H23N3O3
Mol. Mass.365.4256
SMILESO=C1NCN(c2ccccc2)C11CCN(Cc2ccc3OCOc3c2)CC1