Reaction Details
TargetMu-type opioid receptor
LigandBDBM50105076
Substrate/Competitorn/a
Meas. Tech.ChEMBL_149488 (CHEMBL757059)
IC50 84±n/a nM
Citation Poulain, RHorvath, DBonnet, BEckhoff, CChapelain, BBodinier, MCDéprez, B From hit to lead. Analyzing structure-profile relationships. J Med Chem44:3391-401 (2001) Mu-type opioid receptor
Name:Mu-type opioid receptor
Type:G Protein-Coupled Receptor (GPCR)
Mol. Mass.:44789.51
Organism:Homo sapiens (Human)
Description:P35372
Residue:400
BDBM50105076
NameBDBM50105076
Synonyms:8-(3-Phenoxy-benzyl)-1-phenyl-1,3,8-triaza-spiro[4.5]decan-4-one | CHEMBL115280
TypeSmall organic molecule
Emp. Form.C26H27N3O2
Mol. Mass.413.5115
SMILESO=C1NCN(c2ccccc2)C11CCN(Cc2cccc(Oc3ccccc3)c2)CC1