Reaction Details
TargetMelatonin receptor type 1A
LigandBDBM50105061
Substrate/Competitorn/a
Meas. Tech.ChEMBL_105242 (CHEMBL712572)
IC50 1740±n/a nM
Citation Poulain, RHorvath, DBonnet, BEckhoff, CChapelain, BBodinier, MCDéprez, B From hit to lead. Analyzing structure-profile relationships. J Med Chem44:3391-401 (2001) Melatonin receptor type 1A
Name:Melatonin receptor type 1A
Type:Enzyme
Mol. Mass.:39392.94
Organism:Homo sapiens (Human)
Description:P48039
Residue:350
BDBM50105061
NameBDBM50105061
Synonyms:4-(2-Oxo-2,3-dihydro-benzoimidazol-1-yl)-piperidine-1-carboxylic acid 6-chloro-benzo[1,3]dioxol-5-ylmethyl ester | CHEMBL115444
TypeSmall organic molecule
Emp. Form.C21H20ClN3O5
Mol. Mass.429.854
SMILESClc1cc2OCOc2cc1COC(=O)N1CCC(CC1)n1c2ccccc2[nH]c1=O