Reaction Details
TargetHistamine H2 receptor
LigandBDBM50105103
Substrate/Competitorn/a
Meas. Tech.ChEMBL_85522 (CHEMBL697133)
IC50 1340±n/a nM
Citation Poulain, RHorvath, DBonnet, BEckhoff, CChapelain, BBodinier, MCDéprez, B From hit to lead. Analyzing structure-profile relationships. J Med Chem44:3391-401 (2001) Histamine H2 receptor
Name:Histamine H2 receptor
Type:G Protein-Coupled Receptor (GPCR)
Mol. Mass.:40115.31
Organism:Homo sapiens (Human)
Description:n/a
Residue:359
BDBM50105103
NameBDBM50105103
Synonyms:1-{4-[4,4-Bis-(4-fluoro-phenyl)-butyl]-piperazin-1-yl}-3-(4-fluoro-phenyl)-propan-1-one | CHEMBL116735
TypeSmall organic molecule
Emp. Form.C29H31F3N2O
Mol. Mass.480.5644
SMILESFc1ccc(CCC(=O)N2CCN(CCCC(c3ccc(F)cc3)c3ccc(F)cc3)CC2)cc1