Reaction Details
TargetAdenosine deaminase
LigandBDBM50029650
Substrate/Competitorn/a
Meas. Tech.ChEMBL_30812 (CHEMBL645087)
Ki 140000±n/a nM
Citation Hakimelahi, GHLy, TWMoosavi-Movahedi, AAJain, MLZakerinia, MDavari, HMei, HCSambaiah, TMoshfegh, AAHakimelahi, S Design, synthesis, and biological evaluation of novel nucleoside and nucleotide analogues as agents against DNA viruses and/or retroviruses. J Med Chem44:3710-20 (2001) Adenosine deaminase
Name:Adenosine deaminase
Type:Enzyme
Mol. Mass.:40910.44
Organism:Bos taurus (bovine)
Description:n/a
Residue:363
BDBM50029650
NameBDBM50029650
Synonyms:2-(6-Amino-purin-9-ylmethoxy)-ethanol | CHEMBL37752
TypeSmall organic molecule
Emp. Form.C8H11N5O2
Mol. Mass.209.2052
SMILESNc1ncnc2n(COCCO)cnc12