Reaction Details
TargetAdenosine receptor A3
LigandBDBM50106541
Substrate/Competitorn/a
Meas. Tech.ChEMBL_31710 (CHEMBL873053)
Ki 0.19±n/a nM
Citation Jacobson, KAGao, ZGChen, ABarak, DKim, SALee, KLink, ARompaey, PVvan Calenbergh, SLiang, BT Neoceptor concept based on molecular complementarity in GPCRs: a mutant adenosine A(3) receptor with selectively enhanced affinity for amine-modified nucleosides. J Med Chem44:4125-36 (2001) Adenosine receptor A3
Name:Adenosine receptor A3
Type:G Protein-Coupled Receptor (GPCR)
Mol. Mass.:36197.32
Organism:Homo sapiens (Human)
Description:P0DMS8
Residue:318
BDBM50106541
NameBDBM50106541
Synonyms:4-Amino-2-(6-cyclopentylamino-purin-9-yl)-5-hydroxymethyl-tetrahydro-furan-3-ol | CHEMBL133591
TypeSmall organic molecule
Emp. Form.C15H22N6O3
Mol. Mass.334.3736
SMILESN[C@H]1[C@@H](CO)O[C@H]([C@@H]1O)n1cnc2c(NC3CCCC3)ncnc12