Reaction Details
TargetTransient receptor potential cation channel subfamily V member 1
LigandBDBM50107602
Substrate/Competitorn/a
Meas. Tech.ChEMBL_215658 (CHEMBL821205)
Ki>5000±n/a nM
Citation López-Rodríguez, MLViso, AOrtega-Gutiérrez, SLastres-Becker, IGonzález, SFernández-Ruiz, JRamos, JA Design, synthesis and biological evaluation of novel arachidonic acid derivatives as highly potent and selective endocannabinoid transporter inhibitors. J Med Chem44:4505-8 (2001) Transient receptor potential cation channel subfamily V member 1
Name:Transient receptor potential cation channel subfamily V member 1
Type:Transient Receptor
Mol. Mass.:94956.12
Organism:Rattus norvegicus (rat)
Description:O35433
Residue:838
BDBM50107602
NameBDBM50107602
Synonyms:(5Z,8Z,11Z,14Z)-Icosa-5,8,11,14-tetraenoic acid furan-2-ylmethyl ester Icosa-5,8,11,14-tetraenoic acid furan-2-ylmethyl ester
TypeSmall organic molecule
Emp. Form.C25H36O3
Mol. Mass.384.5515
SMILESCCCCC\C=C/C\C=C/C\C=C/C\C=C/CCCC(=O)OCc1ccco1