Reaction Details
TargetTransient receptor potential cation channel subfamily V member 1
LigandBDBM50107600
Substrate/Competitorn/a
Meas. Tech.ChEMBL_215658 (CHEMBL821205)
Ki>5000±n/a nM
Citation López-Rodríguez, MLViso, AOrtega-Gutiérrez, SLastres-Becker, IGonzález, SFernández-Ruiz, JRamos, JA Design, synthesis and biological evaluation of novel arachidonic acid derivatives as highly potent and selective endocannabinoid transporter inhibitors. J Med Chem44:4505-8 (2001) Transient receptor potential cation channel subfamily V member 1
Name:Transient receptor potential cation channel subfamily V member 1
Type:Transient Receptor
Mol. Mass.:94956.12
Organism:Rattus norvegicus (rat)
Description:O35433
Residue:838
BDBM50107600
NameBDBM50107600
Synonyms:(5Z,8Z,11Z,14Z)-(tetrahydrofuran-2-yl)methyl icosa-5,8,11,14-tetraenoate CHEMBL287364 | Icosa-5,8,11,14-tetraenoic acid tetrahydro-furan-2-ylmethyl ester
TypeSmall organic molecule
Emp. Form.C25H40O3
Mol. Mass.388.5833
SMILESCCCCC\C=C/C\C=C/C\C=C/C\C=C/CCCC(=O)OCC1CCCO1