Reaction Details
TargetCannabinoid receptor 1
LigandBDBM22988
Substrate/Competitorn/a
Meas. Tech.ChEMBL_46646 (CHEMBL658901)
Ki 285±n/a nM
Citation López-Rodríguez, MLViso, AOrtega-Gutiérrez, SLastres-Becker, IGonzález, SFernández-Ruiz, JRamos, JA Design, synthesis and biological evaluation of novel arachidonic acid derivatives as highly potent and selective endocannabinoid transporter inhibitors. J Med Chem44:4505-8 (2001) Cannabinoid receptor 1
Name:Cannabinoid receptor 1
Type:G Protein-Coupled Receptor (GPCR)
Mol. Mass.:52856.55
Organism:Rattus norvegicus (rat)
Description:P20272
Residue:473
BDBM22988
NameBDBM22988
Synonyms:(5Z,8Z,11Z,14Z)-N-(2-hydroxyethyl)icosa-5,8,11,14-tetraenamide ANANDAMIDE Arachidonoyl ethanolamide (AEA) Arachidonylethanolamide [14C]Anandamide | [3H]Anandamide
Typeradiolabeled substrate
Emp. Form.C22H37NO2
Mol. Mass.347.5347
SMILESCCCCC\C=C/C\C=C/C\C=C/C\C=C/CCCC(=O)NCCO