Reaction Details
TargetTelomerase reverse transcriptase
LigandBDBM50107609
Substrate/Competitorn/a
Meas. Tech.ChEMBL_225401 (CHEMBL847438)
IC50 6250±n/a nM
Citation Shi, DFWheelhouse, RTSun, DHurley, LH Quadruplex-interactive agents as telomerase inhibitors: synthesis of porphyrins and structure-activity relationship for the inhibition of telomerase. J Med Chem44:4509-23 (2001) Telomerase reverse transcriptase
Name:Telomerase reverse transcriptase
Type:PROTEIN
Mol. Mass.:127099.03
Organism:Homo sapiens (Human)
Description:ChEMBL_1447029
Residue:1132
BDBM50107609
NameBDBM50107609
Synonyms:5,10,15,20-tetra(1-methyl-4-pyridyl)-porphyrin CHEMBL337559 | TMPyP4
TypeSmall organic molecule
Emp. Form.C44H38N8
Mol. Mass.678.8239
SMILESC[n+]1ccc(cc1)-c1c2ccc(n2)c(-c2cc[n+](C)cc2)c2ccc([nH]2)c(-c2cc[n+](C)cc2)c2ccc([nH]2)c(-c2cc[n+](C)cc2)c2ccc1n2