Reaction Details
TargetTelomerase reverse transcriptase
LigandBDBM50369963
Substrate/Competitorn/a
Meas. Tech.ChEMBL_225402 (CHEMBL847439)
IC50 15000±n/a nM
Citation Shi, DFWheelhouse, RTSun, DHurley, LH Quadruplex-interactive agents as telomerase inhibitors: synthesis of porphyrins and structure-activity relationship for the inhibition of telomerase. J Med Chem44:4509-23 (2001) Telomerase reverse transcriptase
Name:Telomerase reverse transcriptase
Type:PROTEIN
Mol. Mass.:127099.03
Organism:Homo sapiens (Human)
Description:ChEMBL_1447029
Residue:1132
BDBM50369963
NameBDBM50369963
Synonyms:CHEMBL1202375
TypeSmall organic molecule
Emp. Form.C50H42Br2N8O2
Mol. Mass.946.728
SMILESC[n+]1ccc(cc1)-c1c2ccc(n2)c(-c2ccc(cc2)C(=O)NCCBr)c2ccc(n2)c(-c2cc[n+](C)cc2)c2ccc([nH]2)c(-c2cccc(c2)C(=O)NCCBr)c2ccc1[nH]2